BDBM298941 US10125118, Example 347::US10947215, Example 347
SMILES CN(C)[C@H]1CCN(Cc2ccc(cc2)-c2cnc(N)c(c2)C(=O)N[C@H]2CCC[C@@H]2OCc2ccc(C)c(C)c2)C1
InChI Key InChIKey=ZPGWQYUCSBEELY-ASVWTAOFSA-N
Data  2 IC50
  Tab Delimited (TSV)   2D SDfile   Computed 3D by Vconf -m prep SDfile
Find this compound or compounds like it in BindingDB:
Activity Spreadsheet -- Enzyme Inhibition Constant Data from BindingDB
Found 2 hits for monomerid = 298941
TargetTyrosine-protein kinase Mer/receptor UFO(Homo sapiens (Human))
Dong-A Socio Holdings
US Patent
LigandPNGBDBM298941(US10125118, Example 347 | US10947215, Example 347)
Affinity DataIC50: <10nM. Assay description: For the SAR (structure-activity relationship) and compound screening, LanthaScreen™ TR-FRET (Time-Resolved fluorescence energy transfer) assay was em...
Ligand InfoPC cidPC sid
In DepthDetails US Patent
TargetTyrosine-protein kinase Mer(Homo sapiens (Human))
Dong-A Socio Holdings
US Patent
LigandPNGBDBM298941(US10125118, Example 347 | US10947215, Example 347)
Affinity DataIC50: <10nM. Assay description: TBD
Ligand InfoPC cidPC sid
In DepthDetails US Patent