BDBM298960 US10125118, Example 366::US10947215, Example 366
SMILES CN1CCC(CC1)n1cc(cn1)-c1cnc(N)c(c1)C(=O)N[C@H]1CCC[C@@H]1OCc1ccc(cc1)-c1ccc(CN2CCN(C)CC2)cc1
InChI Key InChIKey=XWCYFQTYKQHZMY-BCRBLDSWSA-N
Data  2 IC50
  Tab Delimited (TSV)   2D SDfile   Computed 3D by Vconf -m prep SDfile
Find this compound or compounds like it in BindingDB:
Activity Spreadsheet -- Enzyme Inhibition Constant Data from BindingDB
Found 2 hits for monomerid = 298960
TargetTyrosine-protein kinase Mer/receptor UFO(Homo sapiens (Human))
Dong-A Socio Holdings
US Patent
LigandPNGBDBM298960(US10125118, Example 366 | US10947215, Example 366)
Affinity DataIC50: <10nM. Assay description: For the SAR (structure-activity relationship) and compound screening, LanthaScreen™ TR-FRET (Time-Resolved fluorescence energy transfer) assay was em...
Ligand InfoPC cidPC sid
In DepthDetails US Patent
TargetTyrosine-protein kinase Mer(Homo sapiens (Human))
Dong-A Socio Holdings
US Patent
LigandPNGBDBM298960(US10125118, Example 366 | US10947215, Example 366)
Affinity DataIC50: <10nM. Assay description: TBD
Ligand InfoPC cidPC sid
In DepthDetails US Patent