BDBM299063 2,5-dichloro-N-(4-hydroxypyridin-3-yl)thiophene-3-sulfonamide::US10125125, Example 63
SMILES Oc1ccncc1NS(=O)(=O)c1cc(Cl)sc1Cl
InChI Key InChIKey=SLSNOSPCTVDVJA-UHFFFAOYSA-N
Data  1 IC50
  Tab Delimited (TSV)   2D SDfile   Computed 3D by Vconf -m prep SDfile
Find this compound or compounds like it in BindingDB:
Activity Spreadsheet -- Enzyme Inhibition Constant Data from BindingDB
Found 1 hit for monomerid = 299063
TargetProtein S100-A9(Homo sapiens (Human))
Active Biotech
US Patent
LigandPNGBDBM299063(2,5-dichloro-N-(4-hydroxypyridin-3-yl)thiophene-3-...)
Affinity DataIC50:  4.60E+3nM. Assay description: Incubation of Biot-hS100A9+Compound Samples and rhRAGE-Fc-Acceptor Beads in OptiplateWhen the biot-hS100A9+ compound incubation is finished the solut...
Ligand InfoPC cidPC sid
In DepthDetails US Patent