BDBM299129 (6S,8R)-7-(2,3- difluoropropyl)- 6-(4-(2-(3- (fluoromethyl) azetidin-1- yl)ethoxy)-2- methoxyphenyl)- 8-methyl-6,7,8,9- tetrahydro-3H- pyrazolo[4,3- f]isoquinoline::US10125135, Example 18::US10125135, Example 19
SMILES COc1cc(OCCN2CC(CF)C2)ccc1[C@H]1N(CC(F)CF)[C@H](C)Cc2c1ccc1[nH]ncc21
InChI Key
Data  2 IC50
  Tab Delimited (TSV)   2D SDfile   Computed 3D by Vconf -m prep SDfile
Find this compound or compounds like it in BindingDB:
Activity Spreadsheet -- Enzyme Inhibition Constant Data from BindingDB
Found 2 hits for monomerid = 299129
TargetEstrogen receptor(Homo sapiens (Human))
Astrazeneca
US Patent
LigandPNGBDBM299129((6S,8R)-7-(2,3- difluoropropyl)- 6-(4-(2-(3- (fluo...)
Affinity DataIC50:  2.40nM. Assay description: The ability of compounds to bind to isolated Estrogen Receptor Alpha Ligand binding domain (ER alpha LBD (GST)) was assessed in competition assays us...
Ligand InfoPC cidPC sid
In DepthDetails US Patent
TargetEstrogen receptor(Homo sapiens (Human))
Astrazeneca
US Patent
LigandPNGBDBM299129((6S,8R)-7-(2,3- difluoropropyl)- 6-(4-(2-(3- (fluo...)
Affinity DataIC50:  2.40nM. Assay description: The ability of compounds to bind to isolated Estrogen Receptor Alpha Ligand binding domain (ER alpha LBD (GST)) was assessed in competition assays us...
Ligand InfoPC cidPC sid
In DepthDetails US Patent