BDBM29914 substituted 6-aminoquinoline-3-carbonitrile, 25
SMILES NCCCn1cc(CNc2cc(Cl)c3ncc(C#N)c(Nc4ccc(F)c(Cl)c4)c3c2)nn1
InChI Key InChIKey=MAPOACNOCJDFHY-UHFFFAOYSA-N
Data  1 IC50
  Tab Delimited (TSV)   2D SDfile   Computed 3D by Vconf -m prep SDfile
Find this compound or compounds like it in BindingDB:
Activity Spreadsheet -- Enzyme Inhibition Constant Data from BindingDB
Found 1 hit for monomerid = 29914
TargetMitogen-activated protein kinase kinase kinase 8(Homo sapiens (Human))
Wyeth Research
LigandPNGBDBM29914(substituted 6-aminoquinoline-3-carbonitrile, 25)
Affinity DataIC50:  20nMpH: 7.2 T: 2°C. Assay description: Tpl2/Cot activity was directly assayed using GST-MEK1 as a substrate. The phosphorylation on serine residues 217 and 221 of GST-MEK1 was detected by ...
In DepthDetails ArticlePubMed