BDBM299154 (6S,8R)-6-(2,6- difluoro-4-(2-(3- (fluoromethyl) azetidin-1- yl)ethoxy) phenyl)-1-fluoro- 7-((3- fluorooxetan-3- yl)methyl)-8- methyl-6,7,8,9- tetrahydro-3H- pyrazolo[4,3- f]isoquinoline::US10125135, Example 43
SMILES C[C@@H]1Cc2c(ccc3[nH]nc(F)c23)[C@H](N1CC1(F)COC1)c1c(F)cc(OCCN2CC(CF)C2)cc1F
InChI Key
Data  1 IC50
  Tab Delimited (TSV)   2D SDfile   Computed 3D by Vconf -m prep SDfile
Find this compound or compounds like it in BindingDB:
Activity Spreadsheet -- Enzyme Inhibition Constant Data from BindingDB
Found 1 hit for monomerid = 299154
TargetEstrogen receptor(Homo sapiens (Human))
Astrazeneca
US Patent
LigandPNGBDBM299154((6S,8R)-6-(2,6- difluoro-4-(2-(3- (fluoromethyl) a...)
Affinity DataIC50:  2.20nM. Assay description: The ability of compounds to bind to isolated Estrogen Receptor Alpha Ligand binding domain (ER alpha LBD (GST)) was assessed in competition assays us...
Ligand InfoPC cidPC sid
In DepthDetails US Patent