BDBM299156 7-(2,2- difluoroethyl)- 6-(5-(2-(3- (fluoromethyl) azetidin-1- yl)ethoxy) pyridin-2-yl)- 8,8-dimethyl- 6,7,8,9- tetrahydro-3H- pyrazolo[4,3- f]isoquinoline::US10125135, Example 45
SMILES CC1(C)Cc2c(ccc3[nH]ncc23)C(N1CC(F)F)c1ccc(OCCN2CC(CF)C2)cn1
InChI Key
Data  1 IC50
  Tab Delimited (TSV)   2D SDfile   Computed 3D by Vconf -m prep SDfile
Find this compound or compounds like it in BindingDB:
Activity Spreadsheet -- Enzyme Inhibition Constant Data from BindingDB
Found 1 hit for monomerid = 299156
TargetEstrogen receptor(Homo sapiens (Human))
Astrazeneca
US Patent
LigandPNGBDBM299156(7-(2,2- difluoroethyl)- 6-(5-(2-(3- (fluoromethyl)...)
Affinity DataIC50:  7.10nM. Assay description: The ability of compounds to bind to isolated Estrogen Receptor Alpha Ligand binding domain (ER alpha LBD (GST)) was assessed in competition assays us...
Ligand InfoPC cidPC sid
In DepthDetails US Patent