BDBM29918 substituted 6-aminoquinoline-3-carbonitrile, 29
SMILES Fc1ccc(Nc2c(cnc3c(Cl)cc(NCc4cn(CCN5CCOCC5)nn4)cc23)C#N)cc1Cl
InChI Key InChIKey=VEFVJPRFCRDBMD-UHFFFAOYSA-N
Data  1 IC50
  Tab Delimited (TSV)   2D SDfile   Computed 3D by Vconf -m prep SDfile
Find this compound or compounds like it in BindingDB:
Activity Spreadsheet -- Enzyme Inhibition Constant Data from BindingDB
Found 1 hit for monomerid = 29918
TargetMitogen-activated protein kinase kinase kinase 8(Homo sapiens (Human))
Wyeth Research
LigandPNGBDBM29918(substituted 6-aminoquinoline-3-carbonitrile, 29)
Affinity DataIC50:  8nMpH: 7.2 T: 2°C. Assay description: Tpl2/Cot activity was directly assayed using GST-MEK1 as a substrate. The phosphorylation on serine residues 217 and 221 of GST-MEK1 was detected by ...
In DepthDetails ArticlePubMed