BDBM299189 N-(1H-Indazol-5-yl)-2-(isoindolin-2-yl)-5,7-dihydrofuro[3,4-d]pyrimidin-4-amine::US10125144, Example 17
SMILES C1OCc2c1nc(nc2Nc1ccc2[nH]ncc2c1)N1Cc2ccccc2C1
InChI Key InChIKey=KAIFCONTMLZMTE-UHFFFAOYSA-N
Data  1 IC50
  Tab Delimited (TSV)   2D SDfile   Computed 3D by Vconf -m prep SDfile
Find this compound or compounds like it in BindingDB:
Activity Spreadsheet -- Enzyme Inhibition Constant Data from BindingDB
Found 1 hit for monomerid = 299189
TargetRho-associated protein kinase 1(Homo sapiens (Human))
Kadmon
US Patent
LigandPNGBDBM299189(N-(1H-Indazol-5-yl)-2-(isoindolin-2-yl)-5,7-dihydr...)
Affinity DataIC50: >1.00E+4nM. Assay description: Dose response curves for Rho-kinase inhibition were derived from a Invitrogen Z′-LYTE Kinase Assay Kit (Invitrogen catalog number PV3793). Puri...
Ligand InfoPC cidPC sid
In DepthDetails US Patent