BDBM299228 US10125148, Example 22
SMILES CC1C\C=C\CCC2(C)CCN(CC2)c2c([C@H](OC(C)(C)C)C(O)=O)c(C)nc3cc(nn23)-c2cccc(c2)-c2cc(ccc2O1)[N+]#[C-]
InChI Key InChIKey=NIIBEDJIQDFAMQ-UWVAQTCCSA-N
Data  1 EC50
  Tab Delimited (TSV)   2D SDfile   Computed 3D by Vconf -m prep SDfile
Find this compound or compounds like it in BindingDB:
Activity Spreadsheet -- Enzyme Inhibition Constant Data from BindingDB
Found 1 hit for monomerid = 299228
TargetEnvelope glycoprotein gp160(Human immunodeficiency virus type 1 (isolate BRU/L...)
Viiv Healthcare UK (NO.5)
US Patent
LigandPNGBDBM299228(US10125148, Example 22)
Affinity DataEC50:  13nM. Assay description: Inhibition of HIV replication. A recombinant NL-Rluc virus was constructed in which a section of the nef gene from NL4-3 was replaced with the Renill...
Ligand InfoPC cidPC sid
In DepthDetails US Patent