BDBM299237 US9593121, I-02::{(1S,2S,4R)-2-hydroxy-4-[4-(1-methyl-1H-indol-2-yl)- 7H-pyrrolo[2,3-d]pyrimidin-7-yl]cyclopentyl}methyl
SMILES [CH2][C@H]1C[C@H](C[C@@H]1O)n1ccc2c(ncnc12)-c1cc2ccccc2n1C
InChI Key InChIKey=IJTNGILWAIPCPO-OHNRDTAOSA-N
Data  1 IC50
  Tab Delimited (TSV)   2D SDfile   Computed 3D by Vconf -m prep SDfile
Find this compound or compounds like it in BindingDB:
Activity Spreadsheet -- Enzyme Inhibition Constant Data from BindingDB
Found 1 hit for monomerid = 299237
TargetUbiquitin-like modifier-activating enzyme 6(Homo sapiens (Human))
Millennium Pharmaceuticals
US Patent
LigandPNGBDBM299237(US9593121, I-02 | {(1S,2S,4R)-2-hydroxy-4-[4-(1-me...)
Affinity DataIC50:  1.03E+3nM. Assay description: The UBA6 enzmatic reaction totals 20 μL and contains 50 mM HEPES (pH 7.5), 0.05% BSA, 0.02% Tween 20, 0.1 mM TCEP, 5 mM MgCl2, 2 μM ATP, 60...
Ligand InfoPC cidPC sid
In DepthDetails US Patent