BDBM299264 US9593113, Example 29
SMILES COc1ccc(CNC(=O)NC(=O)C(C)(C)[C@@H]2c3ccc(nc3Oc3c(F)cccc23)-c2ccc(cc2)C(C)(C)O)cc1
InChI Key InChIKey=BGVFDIZLUDYWOG-NDEPHWFRSA-N
Data  1 KI
  Tab Delimited (TSV)   2D SDfile   Computed 3D by Vconf -m prep SDfile
Find this compound or compounds like it in BindingDB:
Activity Spreadsheet -- Enzyme Inhibition Constant Data from BindingDB
Found 1 hit for monomerid = 299264
TargetGlucocorticoid receptor(Homo sapiens (Human))
Bristol-Myers Squibb
US Patent
LigandPNGBDBM299264(US9593113, Example 29)
Affinity DataKi:  3.33nM. Assay description: Binding Assay (I):In order to assess the affinity of test compounds for the human glucocorticoid receptor, a commercially available kit was used (Glu...
Ligand InfoPC cidPC sid
In DepthDetails US Patent