BDBM299316 US9593113, Example 80
SMILES CC(C)(O)c1ccc(cc1)-c1ccc2[C@H](c3cccc(F)c3Oc2n1)C(C)(C)C(=O)NC(=O)NCCO
InChI Key InChIKey=QLVDIJOAMVBELP-QFIPXVFZSA-N
Data  1 KI
  Tab Delimited (TSV)   2D SDfile   Computed 3D by Vconf -m prep SDfile
Find this compound or compounds like it in BindingDB:
Activity Spreadsheet -- Enzyme Inhibition Constant Data from BindingDB
Found 1 hit for monomerid = 299316
TargetGlucocorticoid receptor(Homo sapiens (Human))
Bristol-Myers Squibb
US Patent
LigandPNGBDBM299316(US9593113, Example 80)
Affinity DataKi:  25.1nM. Assay description: Binding Assay (I):In order to assess the affinity of test compounds for the human glucocorticoid receptor, a commercially available kit was used (Glu...
Ligand InfoKEGGPC cidPC sid
In DepthDetails US Patent