BDBM29997 benzimidazole analogue, 5b
SMILES C[C@@H]1CN(CC(F)F)CCN1c1cc2[nH]c(SC(C)(C)C)nc2cc1Cl
InChI Key InChIKey=PWTDZYJFBSXIIK-LLVKDONJSA-N
Data  2 IC50
  Tab Delimited (TSV)   2D SDfile   Computed 3D by Vconf -m prep SDfile
Find this compound or compounds like it in BindingDB:
Activity Spreadsheet -- Enzyme Inhibition Constant Data from BindingDB
Found 2 hits for monomerid = 29997
TargetPotassium voltage-gated channel subfamily H member 2(Homo sapiens (Human))
Banyu Pharmaceutical
LigandPNGBDBM29997(benzimidazole analogue, 5b)
Affinity DataIC50: >1.00E+4nM. Assay description: Binding affinity to the hERG K+ channel was measured by displacement of [35S]-radiolabeled MK499 in membranes derived from HEK 293 cells stably trans...
In DepthDetails ArticlePubMed
TargetNociceptin receptor(Homo sapiens (Human))
Banyu Pharmaceutical
LigandPNGBDBM29997(benzimidazole analogue, 5b)
Affinity DataIC50:  23nMpH: 7.4 T: 2°C. Assay description: Compounds were tested for their inhibitory effects on ligand binding to the human ORL1 receptor. Bound and free radioligands are separated by filtra...
In DepthDetails ArticlePubMed