BDBM300035 2-(benzyloxy)-N- [(2R)-1- hydroxypropan-2- yl]-6-[4-(4- methoxy-1H- pyrazolo[3,4- b]pyridin-3- yl)piperidin-1- yl]pyrimidine-4- carboxamide::US9593097, Example 415
SMILES COc1ccnc2[nH]nc(C3CCN(CC3)c3cc(nc(OCc4ccccc4)n3)C(=O)N[C@H](C)CO)c12
InChI Key
Data  1 KI
  Tab Delimited (TSV)   2D SDfile   Computed 3D by Vconf -m prep SDfile
Find this compound or compounds like it in BindingDB:
Activity Spreadsheet -- Enzyme Inhibition Constant Data from BindingDB
Found 1 hit for monomerid = 300035
TargetTyrosine-protein kinase receptor UFO(Homo sapiens (Human))
Pfizer
US Patent
LigandPNGBDBM300035(2-(benzyloxy)-N- [(2R)-1- hydroxypropan-2- yl]-6-[...)
Affinity DataKi: <0.0130nM. Assay description: AXL enzyme inhibition (% inhibition, Kiapp and Ki values) by small molecule inhibitors was evaluated using a fluorescence-based microfluidic mobility...
Ligand InfoPC cidPC sid
In DepthDetails US Patent