BDBM30015 benzimidazole analogue, 7n
SMILES CCN1CCN(CC1)c1cc2[nH]c(S[C@@]3(C)CC[C@@H](CC3)c3nnnn3C)nc2cc1Cl
InChI Key InChIKey=DLGAGPFJWVXJOR-VVONHTQRSA-N
Data  2 IC50  1 EC50
  Tab Delimited (TSV)   2D SDfile   Computed 3D by Vconf -m prep SDfile
Find this compound or compounds like it in BindingDB:
Activity Spreadsheet -- Enzyme Inhibition Constant Data from BindingDB
Found 2 hits for monomerid = 30015
TargetPotassium voltage-gated channel subfamily H member 2(Homo sapiens (Human))
Banyu Pharmaceutical
LigandPNGBDBM30015(benzimidazole analogue, 7n)
Affinity DataIC50:  6.30E+3nM. Assay description: Binding affinity to the hERG K+ channel was measured by displacement of [35S]-radiolabeled MK499 in membranes derived from HEK 293 cells stably trans...
In DepthDetails ArticlePubMed
TargetNociceptin receptor(Homo sapiens (Human))
Banyu Pharmaceutical
LigandPNGBDBM30015(benzimidazole analogue, 7n)
Affinity DataIC50:  7.40nM EC50:  3.70nMpH: 7.4 T: 2°C. Assay description: Compounds were tested for their inhibitory effects on ligand binding to the human ORL1 receptor. Bound and free radioligands are separated by filtra...
In DepthDetails ArticlePubMed