BDBM300415 US10130619, Example 174
SMILES CN(C)C(=O)[C@H](Cc1ccccc1)Oc1ccc(cn1)C(=O)Nc1nnc(s1)-c1ccncc1
InChI Key InChIKey=NIBWODMKXVQENG-IBGZPJMESA-N
Data  1 KI
  Tab Delimited (TSV)   2D SDfile   Computed 3D by Vconf -m prep SDfile
Find this compound or compounds like it in BindingDB:
Activity Spreadsheet -- Enzyme Inhibition Constant Data from BindingDB
Found 1 hit for monomerid = 300415
TargetNADPH oxidase 1(Homo sapiens (Human))
Genkyotex Suisse
US Patent
LigandPNGBDBM300415(US10130619, Example 174)
Affinity DataKi:  96nM. Assay description: All solutions were placed on ice and protected from light. The final concentration in the 1x hNOX1 membrane fluorescent assay buffer was PBS pH7, 6 &...
Ligand InfoPC cidPC sid
In DepthDetails US Patent