BDBM300494 N-[6-(2-fluorophenyl)pyridin-3-yl]-3-{[2-(4-methylpiperazin-1-yl)propanoyl]amino}-4-(trifluoromethoxy)benzamide::US10130633, Example 64
SMILES CC(N1CCN(C)CC1)C(=O)Nc1cc(ccc1OC(F)(F)F)C(=O)Nc1ccc(nc1)-c1ccccc1F
InChI Key InChIKey=MGZGHUHBXOZLPF-UHFFFAOYSA-N
Data  4 IC50
  Tab Delimited (TSV)   2D SDfile   Computed 3D by Vconf -m prep SDfile
Find this compound or compounds like it in BindingDB:
Activity Spreadsheet -- Enzyme Inhibition Constant Data from BindingDB
Found 4 hits for monomerid = 300494
TargetProtein Wnt-3a(Homo sapiens (Human))
Bayer Pharma Aktiengesellschaft
US Patent
LigandPNGBDBM300494(N-[6-(2-fluorophenyl)pyridin-3-yl]-3-{[2-(4-methyl...)
Affinity DataIC50:  23nM. Assay description: In preparation of the assay, the two cell lines were plated 24 hours before at 10000 cells per well of a 384 micro titre plate (MTP) in 30 μL gr...
Ligand InfoPC cidPC sid
In DepthDetails US Patent
TargetProtein Wnt-3a(Homo sapiens (Human))
Bayer Pharma Aktiengesellschaft
US Patent
LigandPNGBDBM300494(N-[6-(2-fluorophenyl)pyridin-3-yl]-3-{[2-(4-methyl...)
Affinity DataIC50: >5.00E+4nM. Assay description: HEK293 cells were cotransfected with the FOP control vector and pcDNA3. The FOP vector is identical to the TOP construct, but it contains instead of ...
Ligand InfoPC cidPC sid
In DepthDetails US Patent
TargetProtein Wnt-3a(Homo sapiens (Human))
Bayer Pharma Aktiengesellschaft
US Patent
LigandPNGBDBM300494(N-[6-(2-fluorophenyl)pyridin-3-yl]-3-{[2-(4-methyl...)
Affinity DataIC50:  37nM. Assay description: In preparation of the assay, the two cell lines were plated 24 hours before beginning the test at 10000 cells per well in a 384 micro titre plate (MT...
Ligand InfoPC cidPC sid
In DepthDetails US Patent
TargetProtein Wnt-3a(Homo sapiens (Human))
Bayer Pharma Aktiengesellschaft
US Patent
LigandPNGBDBM300494(N-[6-(2-fluorophenyl)pyridin-3-yl]-3-{[2-(4-methyl...)
Affinity DataIC50: >5.00E+4nM. Assay description: In preparation of the assay, the two cell lines were plated 24 hours before at 10000 cells per well of a 384 micro titre plate (MTP) in 30 μL gr...
Ligand InfoPC cidPC sid
In DepthDetails US Patent