BDBM3006 3,4-Di-(phenylamino)-1H-pyrazolo[3,4-d]pyrimidine::3-N,4-N-diphenyl-1H-pyrazolo[3,4-d]pyrimidine-3,4-diamine::4-(Phenylamino)pyrazolo[3,4-d]pyrimidine deriv. 7
SMILES N(c1[nH]nc2ncnc(Nc3ccccc3)c12)c1ccccc1
InChI Key InChIKey=IZWVMBDZDRQDDZ-UHFFFAOYSA-N
Data  4 IC50
  Tab Delimited (TSV)   2D SDfile   Computed 3D by Vconf -m prep SDfile
Find this compound or compounds like it in BindingDB:
Activity Spreadsheet -- Enzyme Inhibition Constant Data from BindingDB
Found 4 hits for monomerid = 3006
TargetEpidermal growth factor receptor(Homo sapiens (Human))
Novartis Pharmaceuticals
LigandPNGBDBM3006(3,4-Di-(phenylamino)-1H-pyrazolo[3,4-d]pyrimidine ...)
Affinity DataIC50:  58nMpH: 7.5 T: 2°C. Assay description: IC50 is the inhibitor concentration which inhibits 50% of kinase activity that catalyzes the transfer of the terminal phosphate from [gamma-32P] labe...
In DepthDetails ArticlePubMed
TargetProtein kinase C alpha type(Bos taurus (bovine))
Novartis Pharmaceuticals
LigandPNGBDBM3006(3,4-Di-(phenylamino)-1H-pyrazolo[3,4-d]pyrimidine ...)
Affinity DataIC50:  6.90E+3nMpH: 7.5Assay Description:IC50 is the inhibitor concentration which inhibits 50% of kinase activity that catalyzes the transfer of the terminal phosphate from [gamma-32P] labe...
In DepthDetails ArticlePubMed
TargetProto-oncogene tyrosine-protein kinase Src(Homo sapiens (Human))
Novartis Pharmaceuticals
LigandPNGBDBM3006(3,4-Di-(phenylamino)-1H-pyrazolo[3,4-d]pyrimidine ...)
Affinity DataIC50:  7.50E+4nMpH: 7.5 T: 2°C. Assay description: IC50 is the inhibitor concentration which inhibits 50% of kinase activity that catalyzes the transfer of the terminal phosphate from [gamma-32P] labe...
In DepthDetails ArticlePubMed
TargetTyrosine-protein kinase transforming protein Abl(Abelson murine leukemia virus)
Novartis Pharmaceuticals
LigandPNGBDBM3006(3,4-Di-(phenylamino)-1H-pyrazolo[3,4-d]pyrimidine ...)
Affinity DataIC50:  1.96E+3nMpH: 7.5 T: 2°C. Assay description: IC50 is the inhibitor concentration which inhibits 50% of kinase activity that catalyzes the transfer of the terminal phosphate from [gamma-32P] labe...
In DepthDetails ArticlePubMed