BDBM300754 US10130642, Example 6-6
SMILES CC(CO)(CC(Cc1ccc(cc1)-c1ccccc1)NC(=O)c1cn(Cc2ccccc2)nn1)C(O)=O
InChI Key InChIKey=ABWHMHWNRJEAOA-UHFFFAOYSA-N
Data  1 KI
  Tab Delimited (TSV)   2D SDfile   Computed 3D by Vconf -m prep SDfile
Find this compound or compounds like it in BindingDB:
Activity Spreadsheet -- Enzyme Inhibition Constant Data from BindingDB
Found 1 hit for monomerid = 300754
TargetNeprilysin(Homo sapiens (Human))
Theravance Biopharma R&D Ip
US Patent
LigandPNGBDBM300754(US10130642, Example 6-6)
Affinity DataKi:  35.5nM. Assay description: Recombinant human NEP and recombinant human ACE were obtained commercially (R&D Systems, Minneapolis, Minn., catalog numbers 1182-ZN and 929-ZN, resp...
Ligand InfoPC cidPC sid
In DepthDetails US Patent