BDBM300863 3-[6-([3-[4-(3-Hydroxy-3- methylbutoxy)-2- methylphenyl]-1- benzothiophen-5- yl]methoxy)pyridin-3-yl] hex-4-ynoic acid::US10131648, Compound 61::US10195178, Compound 61::US9790198, Compound 61
SMILES CC#CC(CC(O)=O)c1ccc(OCc2ccc3scc(-c4ccc(OCCC(C)(C)O)cc4C)c3c2)nc1
InChI Key InChIKey=VERDNTDZNSIQCH-UHFFFAOYSA-N
Data  3 EC50
  Tab Delimited (TSV)   2D SDfile   Computed 3D by Vconf -m prep SDfile
Find this compound or compounds like it in BindingDB:
Activity Spreadsheet -- Enzyme Inhibition Constant Data from BindingDB
Found 3 hits for monomerid = 300863
TargetFree fatty acid receptor 1(Homo sapiens (Human))
Janssen Pharmaceutica
US Patent
LigandPNGBDBM300863(3-[6-([3-[4-(3-Hydroxy-3- methylbutoxy)-2- methylp...)
Affinity DataEC50:  16nM. Assay description: Compounds were tested in a calcium flux assay using transfected HEK293 cells stably expressing either human GPR40 or rat GPR40. Human GPR40 expressin...
Ligand InfoPC cidPC sid
In DepthDetails US Patent
TargetFree fatty acid receptor 1(Homo sapiens (Human))
Janssen Pharmaceutica
US Patent
LigandPNGBDBM300863(3-[6-([3-[4-(3-Hydroxy-3- methylbutoxy)-2- methylp...)
Affinity DataEC50:  16nM. Assay description: Compounds were tested in a calcium flux assay using transfected HEK293 cells stably expressing either human GPR40 or rat GPR40. Human GPR40 expressin...
Ligand InfoPC cidPC sid
In DepthDetails US Patent
TargetFree fatty acid receptor 1(Homo sapiens (Human))
Janssen Pharmaceutica
US Patent
LigandPNGBDBM300863(3-[6-([3-[4-(3-Hydroxy-3- methylbutoxy)-2- methylp...)
Affinity DataEC50:  16nM. Assay description: Compounds were tested in a calcium flux assay using transfected HEK293 cells stably expressing either human GPR40 or rat GPR40. Human GPR40 expressin...
Ligand InfoPC cidPC sid
In DepthDetails US Patent