BDBM300922 US10131658, Compound 9
SMILES NCCCCCC(=O)Nc1ccc(C[C@H](NC(=O)[C@@H]2CCCN2S(=O)(=O)c2ccccc2)C(O)=O)cc1
InChI Key InChIKey=AFZXLPLEIXDGBK-GOTSBHOMSA-N
Data  1 IC50
  Tab Delimited (TSV)   2D SDfile   Computed 3D by Vconf -m prep SDfile
Find this compound or compounds like it in BindingDB:
Activity Spreadsheet -- Enzyme Inhibition Constant Data from BindingDB
Found 1 hit for monomerid = 300922
TargetIntegrin alpha-5/beta-1 [T112H](Homo sapiens (Human))
The Regents Of The University Of California
US Patent
LigandPNGBDBM300922(US10131658, Compound 9)
Affinity DataIC50:  5.50E+3nM. Assay description: A panel of cell lines and integrin ligands were developed to allow rapid examination of potency and specificity of inhibitors against all 8 integrins...
Ligand InfoPC cidPC sid
In DepthDetails US Patent