BDBM300947 US10131663, Example 15
SMILES COC[C@@](C)(F)CN1[C@H](C)Cc2c(ccc3[nH]ncc23)[C@H]1c1ccc(NC2CN(CCCF)C2)cc1OC
InChI Key
Data  2 IC50
  Tab Delimited (TSV)   2D SDfile   Computed 3D by Vconf -m prep SDfile
Find this compound or compounds like it in BindingDB:
Activity Spreadsheet -- Enzyme Inhibition Constant Data from BindingDB
Found 2 hits for monomerid = 300947
TargetEstrogen receptor(Homo sapiens (Human))
Astrazeneca
US Patent
LigandPNGBDBM300947(US10131663, Example 15)
Affinity DataIC50:  0.330nM. Assay description: The ability of compounds to down-regulate Estrogen Receptor (ER) numbers was assessed in a cell based immuno-fluorescence assay using the MCF-7 human...
Ligand InfoPC cidPC sid
In DepthDetails US Patent
TargetEstrogen receptor(Homo sapiens (Human))
Astrazeneca
US Patent
LigandPNGBDBM300947(US10131663, Example 15)
Affinity DataIC50:  9.5nM. Assay description: The assay principle is that ER alpha-LBD (GST) is added to a fluorescent ligand to form a receptor/fluorophore complex. A terbium-labelled anti-GST a...
Ligand InfoPC cidPC sid
In DepthDetails US Patent