BDBM300969 BDBM300970::N-(1-(3- fluoropropyl) azetidin-3-yl)-6- ((6S,8R)-6- deuterio-8- methyl-7- (2,2,2- trifluoroethyl)- 6,7,8,9- tetrahydro-3H- pyrazolo[4,3- f]isoquinolin- 6-yl)pyridin-3- amine::US10131663, Example 35::US10590130, Example 32::US10961241, Example 17::US10961241, Example 36
SMILES C[C@@H]1Cc2c(ccc3[nH]ncc23)[C@H](N1CC(F)(F)F)c1ccc(NC2CN(CCCF)C2)cn1
InChI Key
Data  28 IC50
  Tab Delimited (TSV)   2D SDfile   Computed 3D by Vconf -m prep SDfile
Find this compound or compounds like it in BindingDB:
Activity Spreadsheet -- Enzyme Inhibition Constant Data from BindingDB
Found 28 hits for monomerid = 300969
TargetEstrogen receptor(Homo sapiens (Human))
Astrazeneca
US Patent
LigandPNGBDBM300969(BDBM300970 | N-(1-(3- fluoropropyl) azetidin-3-yl)...)
Affinity DataIC50:  1.5nM. Assay description: The assay principle is that ER alpha-LBD (GST) is added to a fluorescent ligand to form a receptor/fluorophore complex. A terbium-labelled anti-GST a...
In DepthDetails US Patent
TargetEstrogen receptor(Homo sapiens (Human))
Astrazeneca
US Patent
LigandPNGBDBM300969(BDBM300970 | N-(1-(3- fluoropropyl) azetidin-3-yl)...)
Affinity DataIC50:  0.158nM. Assay description: Induction of ERalpha degradation in human MCF7 cells incubated for 18 to 22 hrs by immuno-fluorescence assay
In DepthDetails ArticlePubMed
TargetEstrogen receptor(Homo sapiens (Human))
Astrazeneca
US Patent
LigandPNGBDBM300969(BDBM300970 | N-(1-(3- fluoropropyl) azetidin-3-yl)...)
Affinity DataIC50:  1.80nM. Assay description: The assay principle is that ER alpha-LBD (GST) is added to a fluorescent ligand to form a receptor/fluorophore complex. A terbium-labelled anti-GST a...
In DepthDetails US Patent
TargetEstrogen receptor(Homo sapiens (Human))
Astrazeneca
US Patent
LigandPNGBDBM300969(BDBM300970 | N-(1-(3- fluoropropyl) azetidin-3-yl)...)
Affinity DataIC50:  0.120nM. Assay description: The ability of compounds to down-regulate Estrogen Receptor (ER) numbers was assessed in a cell based immuno-fluorescence assay using the MCF-7 human...
In DepthDetails US Patent
TargetPotassium voltage-gated channel subfamily H member 2(Homo sapiens (Human))
Astrazeneca
US Patent
LigandPNGBDBM300969(BDBM300970 | N-(1-(3- fluoropropyl) azetidin-3-yl)...)
Affinity DataIC50:  2.40nM. Assay description: hERG (human ether go go-related gene) potassium channels are essential for normal electrical activity in the heart. Arrhythmia can be induced by a bl...
In DepthDetails US Patent
TargetPotassium voltage-gated channel subfamily H member 2(Homo sapiens (Human))
Astrazeneca
US Patent
LigandPNGBDBM300969(BDBM300970 | N-(1-(3- fluoropropyl) azetidin-3-yl)...)
Affinity DataIC50:  2.10nM. Assay description: hERG (human ether go go-related gene) potassium channels are essential for normal electrical activity in the heart. Arrhythmia can be induced by a bl...
In DepthDetails US Patent
TargetPotassium voltage-gated channel subfamily H member 2(Homo sapiens (Human))
Astrazeneca
US Patent
LigandPNGBDBM300969(BDBM300970 | N-(1-(3- fluoropropyl) azetidin-3-yl)...)
Affinity DataIC50:  1.5nM. Assay description: hERG (human ether go go-related gene) potassium channels are essential for normal electrical activity in the heart. Arrhythmia can be induced by a bl...
In DepthDetails US Patent
TargetPotassium voltage-gated channel subfamily H member 2(Homo sapiens (Human))
Astrazeneca
US Patent
LigandPNGBDBM300969(BDBM300970 | N-(1-(3- fluoropropyl) azetidin-3-yl)...)
Affinity DataIC50:  1.80nM. Assay description: hERG (human ether go go-related gene) potassium channels are essential for normal electrical activity in the heart. Arrhythmia can be induced by a bl...
In DepthDetails US Patent
TargetEstrogen receptor [307-554](Homo sapiens (Human))
Astrazeneca
US Patent
LigandPNGBDBM300969(BDBM300970 | N-(1-(3- fluoropropyl) azetidin-3-yl)...)
Affinity DataIC50:  2.20E+4nM. Assay description: ER: The ability of compounds to bind to isolated Estrogen Receptor Alpha Ligand binding domain (ER alpha-LBD (GST)) was assessed in competition assay...
In DepthDetails US Patent
TargetEstrogen receptor [307-554](Homo sapiens (Human))
Astrazeneca
US Patent
LigandPNGBDBM300969(BDBM300970 | N-(1-(3- fluoropropyl) azetidin-3-yl)...)
Affinity DataIC50:  1.40E+4nM. Assay description: ER: The ability of compounds to bind to isolated Estrogen Receptor Alpha Ligand binding domain (ER alpha-LBD (GST)) was assessed in competition assay...
In DepthDetails US Patent
TargetEstrogen receptor [307-554](Homo sapiens (Human))
Astrazeneca
US Patent
LigandPNGBDBM300969(BDBM300970 | N-(1-(3- fluoropropyl) azetidin-3-yl)...)
Affinity DataIC50:  2.40nM. Assay description: The assay was performed as follows with all reagent additions carried out using the Beckman Coulter BioRAPTR FRD microfluidic workstation:1. Acoustic...
In DepthDetails US Patent
TargetEstrogen receptor [307-554](Homo sapiens (Human))
Astrazeneca
US Patent
LigandPNGBDBM300969(BDBM300970 | N-(1-(3- fluoropropyl) azetidin-3-yl)...)
Affinity DataIC50:  1.5nM. Assay description: The assay was performed as follows with all reagent additions carried out using the Beckman Coulter BioRAPTR FRD microfluidic workstation:1. Acoustic...
In DepthDetails US Patent
TargetEstrogen receptor [307-554](Homo sapiens (Human))
Astrazeneca
US Patent
LigandPNGBDBM300969(BDBM300970 | N-(1-(3- fluoropropyl) azetidin-3-yl)...)
Affinity DataIC50:  1.80nM. Assay description: The assay was performed as follows with all reagent additions carried out using the Beckman Coulter BioRAPTR FRD microfluidic workstation:1. Acoustic...
In DepthDetails US Patent
TargetCytochrome P450 2C9(Homo sapiens (Human))
Astrazeneca
Curated by ChEMBL
LigandPNGBDBM300969(BDBM300970 | N-(1-(3- fluoropropyl) azetidin-3-yl)...)
Affinity DataIC50: >3.00E+4nM. Assay description: Inhibition of CYP2C9 in human liver microsomes
In DepthDetails ArticlePubMed
TargetCytochrome P450 2C19(Homo sapiens (Human))
Astrazeneca
Curated by ChEMBL
LigandPNGBDBM300969(BDBM300970 | N-(1-(3- fluoropropyl) azetidin-3-yl)...)
Affinity DataIC50: >3.00E+4nM. Assay description: Inhibition of CYP2C19 in human liver microsomes
In DepthDetails ArticlePubMed
TargetCytochrome P450 1A2(Homo sapiens (Human))
Astrazeneca
Curated by ChEMBL
LigandPNGBDBM300969(BDBM300970 | N-(1-(3- fluoropropyl) azetidin-3-yl)...)
Affinity DataIC50: >3.00E+4nM. Assay description: Inhibition of CYP1A2 in human liver microsomes
In DepthDetails ArticlePubMed
TargetEstrogen receptor(Homo sapiens (Human))
Astrazeneca
US Patent
LigandPNGBDBM300969(BDBM300970 | N-(1-(3- fluoropropyl) azetidin-3-yl)...)
Affinity DataIC50:  6.30nM. Assay description: Induction of ERalpha degradation in human MCF7 cells assessed as decrease in ERalpha expression in presence of tamoxifen by Western blot analysis
In DepthDetails ArticlePubMed
TargetEstrogen receptor(Homo sapiens (Human))
Astrazeneca
US Patent
LigandPNGBDBM300969(BDBM300970 | N-(1-(3- fluoropropyl) azetidin-3-yl)...)
Affinity DataIC50:  0.126nM. Assay description: Induction of ERalpha degradation in human MCF7 cells assessed as decrease in ERalpha expression in presence of cycloheximide by Western blot analysis
In DepthDetails ArticlePubMed
TargetEstrogen receptor(Homo sapiens (Human))
Astrazeneca
US Patent
LigandPNGBDBM300969(BDBM300970 | N-(1-(3- fluoropropyl) azetidin-3-yl)...)
Affinity DataIC50: <316nM. Assay description: Agonist activity at ERalpha in human MCF7 cells assessed as increase in progesterone receptor expression level by western blot analysis
In DepthDetails ArticlePubMed
TargetEstrogen receptor(Homo sapiens (Human))
Astrazeneca
US Patent
LigandPNGBDBM300969(BDBM300970 | N-(1-(3- fluoropropyl) azetidin-3-yl)...)
Affinity DataIC50:  0.158nM. Assay description: Induction of ERalpha degradation in human MCF7 cells assessed as decrease in ERalpha expression by Western blot analysis
In DepthDetails ArticlePubMed
TargetHistamine H3 receptor(Homo sapiens (Human))
Astrazeneca
Curated by ChEMBL
LigandPNGBDBM300969(BDBM300970 | N-(1-(3- fluoropropyl) azetidin-3-yl)...)
Affinity DataIC50:  330nM. Assay description: Antagonist activity at human histamine H3 receptor expressed in CHO-K1 cells after 10 mins by HTRF assay
In DepthDetails ArticlePubMed
TargetPotassium voltage-gated channel subfamily H member 2(Homo sapiens (Human))
Astrazeneca
US Patent
LigandPNGBDBM300969(BDBM300970 | N-(1-(3- fluoropropyl) azetidin-3-yl)...)
Affinity DataIC50:  2.20E+4nM. Assay description: Inhibition of human ERG by plate-based planar patch clamp technique
In DepthDetails ArticlePubMed
TargetCytochrome P450 3A4(Homo sapiens (Human))
Astrazeneca
Curated by ChEMBL
LigandPNGBDBM300969(BDBM300970 | N-(1-(3- fluoropropyl) azetidin-3-yl)...)
Affinity DataIC50:  2.20E+3nM. Assay description: Inhibition of CYP3A4 in human liver microsomes
In DepthDetails ArticlePubMed
TargetCytochrome P450 2D6(Homo sapiens (Human))
Astrazeneca
Curated by ChEMBL
LigandPNGBDBM300969(BDBM300970 | N-(1-(3- fluoropropyl) azetidin-3-yl)...)
Affinity DataIC50:  4.30E+3nM. Assay description: Inhibition of CYP2D6 in human liver microsomes
In DepthDetails ArticlePubMed
TargetEstrogen receptor(Homo sapiens (Human))
Astrazeneca
US Patent
LigandPNGBDBM300969(BDBM300970 | N-(1-(3- fluoropropyl) azetidin-3-yl)...)
Affinity DataIC50:  0.158nM. Assay description: Induction of ERalpha degradation in human MCF7 cells assessed as decrease in ER-alpha level incubated for 18 to 24 hrs by Alexa fluor 488/Hoechst sta...
In DepthDetails ArticlePubMed
TargetEstrogen receptor(Homo sapiens (Human))
Astrazeneca
US Patent
LigandPNGBDBM300969(BDBM300970 | N-(1-(3- fluoropropyl) azetidin-3-yl)...)
Affinity DataIC50:  2.5nM. Assay description: Displacement of fluormone ES2 green reagent from human GST-tagged ERalpha LBD (282 to 595 residues) expressed in baculovirus infected insect cells in...
In DepthDetails ArticlePubMed
TargetEstrogen receptor(Homo sapiens (Human))
Astrazeneca
US Patent
LigandPNGBDBM300969(BDBM300970 | N-(1-(3- fluoropropyl) azetidin-3-yl)...)
Affinity DataIC50:  2.5nM. Assay description: Displacement of fluorescent labelled fluormone ES2 from human recombinant GST tagged ER alpha LBD ( 282 to 595 residues) expressed in baculovirus inf...
In DepthDetails ArticlePubMed
TargetEstrogen receptor(Homo sapiens (Human))
Astrazeneca
US Patent
LigandPNGBDBM300969(BDBM300970 | N-(1-(3- fluoropropyl) azetidin-3-yl)...)
Affinity DataIC50:  0.170nM. Assay description: The ability of compounds to down-regulate Estrogen Receptor (ER) numbers was assessed in a cell based immuno-fluorescence assay using the MCF-7 human...
In DepthDetails US Patent