BDBM300990 N-(4-((6S,8R)- 7-((1- fluorocyclo- propyl)methyl)-8- methyl- 6,7,8,9- tetrahydro-3H- pyrazolo[4,3- f]isoquinolin- 6-yl)-3- methoxyphenyl)- 1-(3,3,3- trifluoropropyl) azetidin-3- amine::US10131663, Example 56::US10590130, Example 56::US10961241, Example 56
SMILES COc1cc(NC2CN(CCC(F)(F)F)C2)ccc1[C@H]1N(CC2(F)CC2)[C@H](C)Cc2c1ccc1[nH]ncc21
InChI Key
Data  4 IC50
  Tab Delimited (TSV)   2D SDfile   Computed 3D by Vconf -m prep SDfile
Find this compound or compounds like it in BindingDB:
Activity Spreadsheet -- Enzyme Inhibition Constant Data from BindingDB
Found 4 hits for monomerid = 300990
TargetEstrogen receptor(Homo sapiens (Human))
Astrazeneca
US Patent
LigandPNGBDBM300990(N-(4-((6S,8R)- 7-((1- fluorocyclo- propyl)methyl)-...)
Affinity DataIC50:  8.20nM. Assay description: The assay principle is that ER alpha-LBD (GST) is added to a fluorescent ligand to form a receptor/fluorophore complex. A terbium-labelled anti-GST a...
Ligand InfoPC cidPC sid
In DepthDetails US Patent
TargetEstrogen receptor [307-554](Homo sapiens (Human))
Astrazeneca
US Patent
LigandPNGBDBM300990(N-(4-((6S,8R)- 7-((1- fluorocyclo- propyl)methyl)-...)
Affinity DataIC50:  8.20nM. Assay description: The assay was performed as follows with all reagent additions carried out using the Beckman Coulter BioRAPTR FRD microfluidic workstation:1. Acoustic...
Ligand InfoPC cidPC sid
In DepthDetails US Patent
TargetPotassium voltage-gated channel subfamily H member 2(Homo sapiens (Human))
Astrazeneca
US Patent
LigandPNGBDBM300990(N-(4-((6S,8R)- 7-((1- fluorocyclo- propyl)methyl)-...)
Affinity DataIC50:  8.20nM. Assay description: hERG (human ether go go-related gene) potassium channels are essential for normal electrical activity in the heart. Arrhythmia can be induced by a bl...
Ligand InfoPC cidPC sid
In DepthDetails US Patent
TargetEstrogen receptor(Homo sapiens (Human))
Astrazeneca
US Patent
LigandPNGBDBM300990(N-(4-((6S,8R)- 7-((1- fluorocyclo- propyl)methyl)-...)
Affinity DataIC50:  0.580nM. Assay description: The ability of compounds to down-regulate Estrogen Receptor (ER) numbers was assessed in a cell based immuno-fluorescence assay using the MCF-7 human...
Ligand InfoPC cidPC sid
In DepthDetails US Patent