BDBM301003 N-(1-(3- fluoropropyl) azetidin-3-yl)-6- ((6S,8R)-7- isobutyl-8- methyl- 6,7,8,9- tetrahydro-3H- pyrazolo[4,3- f]isoquinolin- 6-yl)pyridin-3- amine::US10131663, Example 69::US10590130, Example 69::US10961241, Example 69
SMILES CC(C)CN1[C@H](C)Cc2c(ccc3[nH]ncc23)[C@H]1c1ccc(NC2CN(CCCF)C2)cn1
InChI Key
Data  6 IC50
  Tab Delimited (TSV)   2D SDfile   Computed 3D by Vconf -m prep SDfile
Find this compound or compounds like it in BindingDB:
Activity Spreadsheet -- Enzyme Inhibition Constant Data from BindingDB
Found 6 hits for monomerid = 301003
TargetEstrogen receptor(Homo sapiens (Human))
Astrazeneca
US Patent
LigandPNGBDBM301003(N-(1-(3- fluoropropyl) azetidin-3-yl)-6- ((6S,8R)...)
Affinity DataIC50:  8.90nM. Assay description: The assay principle is that ER alpha-LBD (GST) is added to a fluorescent ligand to form a receptor/fluorophore complex. A terbium-labelled anti-GST a...
Ligand InfoPC cidPC sid
In DepthDetails US Patent
TargetEstrogen receptor(Homo sapiens (Human))
Astrazeneca
US Patent
LigandPNGBDBM301003(N-(1-(3- fluoropropyl) azetidin-3-yl)-6- ((6S,8R)...)
Affinity DataIC50:  0.550nM. Assay description: The ability of compounds to down-regulate Estrogen Receptor (ER) numbers was assessed in a cell based immuno-fluorescence assay using the MCF-7 human...
Ligand InfoPC cidPC sid
In DepthDetails US Patent
TargetEstrogen receptor [307-554](Homo sapiens (Human))
Astrazeneca
US Patent
LigandPNGBDBM301003(N-(1-(3- fluoropropyl) azetidin-3-yl)-6- ((6S,8R)...)
Affinity DataIC50:  8.90nM. Assay description: The assay was performed as follows with all reagent additions carried out using the Beckman Coulter BioRAPTR FRD microfluidic workstation:1. Acoustic...
Ligand InfoPC cidPC sid
In DepthDetails US Patent
TargetPotassium voltage-gated channel subfamily H member 2(Homo sapiens (Human))
Astrazeneca
US Patent
LigandPNGBDBM301003(N-(1-(3- fluoropropyl) azetidin-3-yl)-6- ((6S,8R)...)
Affinity DataIC50:  8.90nM. Assay description: hERG (human ether go go-related gene) potassium channels are essential for normal electrical activity in the heart. Arrhythmia can be induced by a bl...
Ligand InfoPC cidPC sid
In DepthDetails US Patent
TargetEstrogen receptor [307-554](Homo sapiens (Human))
Astrazeneca
US Patent
LigandPNGBDBM301003(N-(1-(3- fluoropropyl) azetidin-3-yl)-6- ((6S,8R)...)
Affinity DataIC50:  2.40E+4nM. Assay description: ER: The ability of compounds to bind to isolated Estrogen Receptor Alpha Ligand binding domain (ER alpha-LBD (GST)) was assessed in competition assay...
Ligand InfoPC cidPC sid
In DepthDetails US Patent
TargetPotassium voltage-gated channel subfamily H member 2(Homo sapiens (Human))
Astrazeneca
US Patent
LigandPNGBDBM301003(N-(1-(3- fluoropropyl) azetidin-3-yl)-6- ((6S,8R)...)
Affinity DataIC50:  2.40E+4nM. Assay description: hERG (human ether go go-related gene) potassium channels are essential for normal electrical activity in the heart. Arrhythmia can be induced by a bl...
Ligand InfoPC cidPC sid
In DepthDetails US Patent