BDBM301131 4-[2-(4-aminopiperidin-1-yl)-5-[6- (cyclopropylmethoxy)pyridin-3- yl]pyrimidin-4-yl]benzonitrile::US10131664, Example 124
SMILES NC1CCN(CC1)c1ncc(-c2ccc(OCC3CC3)nc2)c(n1)-c1ccc(cc1)C#N
InChI Key InChIKey=QITVHDTZWLDFSG-UHFFFAOYSA-N
Data  1 IC50
  Tab Delimited (TSV)   2D SDfile   Computed 3D by Vconf -m prep SDfile
Find this compound or compounds like it in BindingDB:
Activity Spreadsheet -- Enzyme Inhibition Constant Data from BindingDB
Found 1 hit for monomerid = 301131
TargetLysine-specific histone demethylase 1A(Homo sapiens (Human))
Celgene Quanticel Research
US Patent
LigandPNGBDBM301131(4-[2-(4-aminopiperidin-1-yl)-5-[6- (cyclopropylmet...)
Affinity DataIC50: <10nM. Assay description: The enzymatic assay of LSD1 activity is based on Time Resolved-Fluorescence Resonance Energy Transfer (TR-FRET) detection. The inhibitory properties ...
Ligand InfoPC cidPC sid
In DepthDetails US Patent