BDBM301157 4-[2-(4-aminopiperidin-1-yl)-6- methoxy-5-(2-methyl-2H-indazol-6- yl)pyrimidin-4-yl]-2-fluorobenzonitrile::US10131664, Example 150
SMILES COc1nc(nc(-c2ccc(C#N)c(F)c2)c1-c1ccc2cn(C)nc2c1)N1CCC(N)CC1
InChI Key InChIKey=JAZDAUQBQINNAR-UHFFFAOYSA-N
Data  1 IC50
  Tab Delimited (TSV)   2D SDfile   Computed 3D by Vconf -m prep SDfile
Find this compound or compounds like it in BindingDB:
Activity Spreadsheet -- Enzyme Inhibition Constant Data from BindingDB
Found 1 hit for monomerid = 301157
TargetLysine-specific histone demethylase 1A(Homo sapiens (Human))
Celgene Quanticel Research
US Patent
LigandPNGBDBM301157(4-[2-(4-aminopiperidin-1-yl)-6- methoxy-5-(2-methy...)
Affinity DataIC50: <10nM. Assay description: The enzymatic assay of LSD1 activity is based on Time Resolved-Fluorescence Resonance Energy Transfer (TR-FRET) detection. The inhibitory properties ...
Ligand InfoPC cidPC sid
In DepthDetails US Patent