BDBM301203 3-(3,5-Dimethoxyphenyl)-N,N,1-trimethyl-2-oxo-2,3,4,7-tetrahydro-1H-pyrrolo[3',2':5,6]pyrido[4,3-d]pyrimidine-8-carboxamide::US10131667, Example 19::US11053246, Example 19::US9611267, Example 19
SMILES COc1cc(OC)cc(c1)N1Cc2cnc3[nH]c(cc3c2N(C)C1=O)C(=O)N(C)C
InChI Key InChIKey=MOZDYHQDSMTOKE-UHFFFAOYSA-N
Data  9 IC50
  Tab Delimited (TSV)   2D SDfile   Computed 3D by Vconf -m prep SDfile
Find this compound or compounds like it in BindingDB:
Activity Spreadsheet -- Enzyme Inhibition Constant Data from BindingDB
Found 9 hits for monomerid = 301203
TargetFibroblast growth factor receptor 1(Homo sapiens (Human))
Incyte
US Patent
LigandPNGBDBM301203(3-(3,5-Dimethoxyphenyl)-N,N,1-trimethyl-2-oxo-2,3,...)
Affinity DataIC50: <100nM. Assay description: The inhibitor potency of the exemplified compounds was measured in an enzyme assay that measures peptide phosphorylation using FRET measurements to d...
Ligand InfoPC cidPC sid
In DepthDetails US Patent
TargetFibroblast growth factor receptor 2(Homo sapiens (Human))
Incyte
US Patent
LigandPNGBDBM301203(3-(3,5-Dimethoxyphenyl)-N,N,1-trimethyl-2-oxo-2,3,...)
Affinity DataIC50: <100nM
Ligand InfoPC cidPC sid
In DepthDetails US Patent
TargetFibroblast growth factor receptor 3(Homo sapiens (Human))
Incyte
US Patent
LigandPNGBDBM301203(3-(3,5-Dimethoxyphenyl)-N,N,1-trimethyl-2-oxo-2,3,...)
Affinity DataIC50: <100nM
Ligand InfoPC cidPC sid
In DepthDetails US Patent
TargetFibroblast growth factor receptor 1(Homo sapiens (Human))
Incyte
US Patent
LigandPNGBDBM301203(3-(3,5-Dimethoxyphenyl)-N,N,1-trimethyl-2-oxo-2,3,...)
Affinity DataIC50: <100nM. Assay description: The inhibitor potency of the exemplified compounds was measured in an enzyme assay that measures peptide phosphorylation using FRET measurements to d...
Ligand InfoPC cidPC sid
In DepthDetails US Patent
TargetFibroblast growth factor receptor 3(Homo sapiens (Human))
Incyte
US Patent
LigandPNGBDBM301203(3-(3,5-Dimethoxyphenyl)-N,N,1-trimethyl-2-oxo-2,3,...)
Affinity DataIC50: <100nM. Assay description: The inhibitor potency of the exemplified compounds was measured in an enzyme assay that measures peptide phosphorylation using FRET measurements to d...
Ligand InfoPC cidPC sid
In DepthDetails US Patent
TargetFibroblast growth factor receptor 3(Homo sapiens (Human))
Incyte
US Patent
LigandPNGBDBM301203(3-(3,5-Dimethoxyphenyl)-N,N,1-trimethyl-2-oxo-2,3,...)
Affinity DataIC50: <100nM. Assay description: The inhibitor potency of the exemplified compounds was measured in an enzyme assay that measures peptide phosphorylation using FRET measurements to d...
Ligand InfoPC cidPC sid
In DepthDetails US Patent
TargetFibroblast growth factor receptor 1(Homo sapiens (Human))
Incyte
US Patent
LigandPNGBDBM301203(3-(3,5-Dimethoxyphenyl)-N,N,1-trimethyl-2-oxo-2,3,...)
Affinity DataIC50: <100nM. Assay description: The inhibitor potency of the exemplified compounds was measured in an enzyme assay that measures peptide phosphorylation using FRET measurements to d...
Ligand InfoPC cidPC sid
In DepthDetails US Patent
TargetFibroblast growth factor receptor 2(Homo sapiens (Human))
Incyte
US Patent
LigandPNGBDBM301203(3-(3,5-Dimethoxyphenyl)-N,N,1-trimethyl-2-oxo-2,3,...)
Affinity DataIC50: <100nM. Assay description: The inhibitor potency of the exemplified compounds was measured in an enzyme assay that measures peptide phosphorylation using FRET measurements to d...
Ligand InfoPC cidPC sid
In DepthDetails US Patent
TargetFibroblast growth factor receptor 2(Homo sapiens (Human))
Incyte
US Patent
LigandPNGBDBM301203(3-(3,5-Dimethoxyphenyl)-N,N,1-trimethyl-2-oxo-2,3,...)
Affinity DataIC50: <100nM. Assay description: The inhibitor potency of the exemplified compounds was measured in an enzyme assay that measures peptide phosphorylation using FRET measurements to d...
Ligand InfoPC cidPC sid
In DepthDetails US Patent