BDBM301375 3-(2,6-difluoro-3,5-dimethoxyphenyl)-1-(4-fluorophenyl)-8-[(4-ethylpiperazin-1-yl)methyl]-1,3,4,7-tetrahydro-2H-pyrrolo[3',2':5,6]pyrido[4,3-d]pyrimidin-2-one::US10131667, Example 191::US11053246, Example 191::US9611267, Example 191
SMILES CCN1CCN(Cc2cc3c4N(C(=O)N(Cc4cnc3[nH]2)c2c(F)c(OC)cc(OC)c2F)c2ccc(F)cc2)CC1
InChI Key InChIKey=VXFMOWIEVPPKJB-UHFFFAOYSA-N
Data  9 IC50
  Tab Delimited (TSV)   2D SDfile   Computed 3D by Vconf -m prep SDfile
Find this compound or compounds like it in BindingDB:
Activity Spreadsheet -- Enzyme Inhibition Constant Data from BindingDB
Found 9 hits for monomerid = 301375
TargetFibroblast growth factor receptor 1(Homo sapiens (Human))
Incyte
US Patent
LigandPNGBDBM301375(3-(2,6-difluoro-3,5-dimethoxyphenyl)-1-(4-fluoroph...)
Affinity DataIC50: <100nM. Assay description: The inhibitor potency of the exemplified compounds was measured in an enzyme assay that measures peptide phosphorylation using FRET measurements to d...
Ligand InfoPC cidPC sid
In DepthDetails US Patent
TargetFibroblast growth factor receptor 2(Homo sapiens (Human))
Incyte
US Patent
LigandPNGBDBM301375(3-(2,6-difluoro-3,5-dimethoxyphenyl)-1-(4-fluoroph...)
Affinity DataIC50: <100nM
Ligand InfoPC cidPC sid
In DepthDetails US Patent
TargetFibroblast growth factor receptor 3(Homo sapiens (Human))
Incyte
US Patent
LigandPNGBDBM301375(3-(2,6-difluoro-3,5-dimethoxyphenyl)-1-(4-fluoroph...)
Affinity DataIC50: <100nM
Ligand InfoPC cidPC sid
In DepthDetails US Patent
TargetFibroblast growth factor receptor 1(Homo sapiens (Human))
Incyte
US Patent
LigandPNGBDBM301375(3-(2,6-difluoro-3,5-dimethoxyphenyl)-1-(4-fluoroph...)
Affinity DataIC50: <100nM. Assay description: The inhibitor potency of the exemplified compounds was measured in an enzyme assay that measures peptide phosphorylation using FRET measurements to d...
Ligand InfoPC cidPC sid
In DepthDetails US Patent
TargetFibroblast growth factor receptor 3(Homo sapiens (Human))
Incyte
US Patent
LigandPNGBDBM301375(3-(2,6-difluoro-3,5-dimethoxyphenyl)-1-(4-fluoroph...)
Affinity DataIC50: <100nM. Assay description: The inhibitor potency of the exemplified compounds was measured in an enzyme assay that measures peptide phosphorylation using FRET measurements to d...
Ligand InfoPC cidPC sid
In DepthDetails US Patent
TargetFibroblast growth factor receptor 3(Homo sapiens (Human))
Incyte
US Patent
LigandPNGBDBM301375(3-(2,6-difluoro-3,5-dimethoxyphenyl)-1-(4-fluoroph...)
Affinity DataIC50: <100nM. Assay description: The inhibitor potency of the exemplified compounds was measured in an enzyme assay that measures peptide phosphorylation using FRET measurements to d...
Ligand InfoPC cidPC sid
In DepthDetails US Patent
TargetFibroblast growth factor receptor 1(Homo sapiens (Human))
Incyte
US Patent
LigandPNGBDBM301375(3-(2,6-difluoro-3,5-dimethoxyphenyl)-1-(4-fluoroph...)
Affinity DataIC50: <100nM. Assay description: The inhibitor potency of the exemplified compounds was measured in an enzyme assay that measures peptide phosphorylation using FRET measurements to d...
Ligand InfoPC cidPC sid
In DepthDetails US Patent
TargetFibroblast growth factor receptor 2(Homo sapiens (Human))
Incyte
US Patent
LigandPNGBDBM301375(3-(2,6-difluoro-3,5-dimethoxyphenyl)-1-(4-fluoroph...)
Affinity DataIC50: <100nM. Assay description: The inhibitor potency of the exemplified compounds was measured in an enzyme assay that measures peptide phosphorylation using FRET measurements to d...
Ligand InfoPC cidPC sid
In DepthDetails US Patent
TargetFibroblast growth factor receptor 2(Homo sapiens (Human))
Incyte
US Patent
LigandPNGBDBM301375(3-(2,6-difluoro-3,5-dimethoxyphenyl)-1-(4-fluoroph...)
Affinity DataIC50: <100nM. Assay description: The inhibitor potency of the exemplified compounds was measured in an enzyme assay that measures peptide phosphorylation using FRET measurements to d...
Ligand InfoPC cidPC sid
In DepthDetails US Patent