BDBM301471 4-amino-5-[2-(difluoromethyl)pyrimidin-5-yl]-7-{1-[1-(2-fluorophenyl)-1H-pyrazol-4-yl]ethyl}pyrrolo[2,1-f][1,2,4]triazine-6-carbonitrile,enantiomer 2::US10131670, Example 97
SMILES C[C@@H](c1cnn(c1)-c1ccccc1F)c1c(C#N)c(-c2cnc(nc2)C(F)F)c2c(N)ncnn12
InChI Key InChIKey=SAMIUHUFHOUXDH-LBPRGKRZSA-N
Data  1 EC50
  Tab Delimited (TSV)   2D SDfile   Computed 3D by Vconf -m prep SDfile
Find this compound or compounds like it in BindingDB:
Activity Spreadsheet -- Enzyme Inhibition Constant Data from BindingDB
Found 1 hit for monomerid = 301471
TargetCystic fibrosis transmembrane conductance regulator(Homo sapiens (Human))
Cystic Fibrosis Foundation Therapeutics
US Patent
LigandPNGBDBM301471(4-amino-5-[2-(difluoromethyl)pyrimidin-5-yl]-7-{1-...)
Affinity DataEC50:  3.87nM. Assay description: Primary cystic fibrosis human bronchial epithelial (CF hBE) cells were expanded and cultured according to published methods (Neuberger et al., Ch. 4 ...
Ligand InfoPC cidPC sid
In DepthDetails US Patent