BDBM301477 US10131673, Compound P4
SMILES Cc1ccc2ncnc(N3CCCCC3c3cc4nc5CCCCc5c(N5CCOCC5)n4n3)c2c1
InChI Key InChIKey=SOWVTMOUYSZUSA-UHFFFAOYSA-N
Data  1 EC50
  Tab Delimited (TSV)   2D SDfile   Computed 3D by Vconf -m prep SDfile
Find this compound or compounds like it in BindingDB:
Activity Spreadsheet -- Enzyme Inhibition Constant Data from BindingDB
Found 1 hit for monomerid = 301477
TargetProtein M2-1(Human respiratory syncytial virus A (strain A2))
Janssen Ireland
US Patent
LigandPNGBDBM301477(US10131673, Compound P4)
Affinity DataEC50:  166nM. Assay description: Black 384-well clear-bottom microtiter plates (Corning, Amsterdam, The Netherlands) were filled via acoustic drop ejection using the echo liquid hand...
Ligand InfoPC cidPC sid
In DepthDetails US Patent