BDBM301565 US10131675, Example 51
SMILES CC1(C)OCCn2c1nc1c(nc(nc21)-c1cnc(N)nc1)N1CC2(C1)CCCO2
InChI Key InChIKey=XTARECAANYQIPU-UHFFFAOYSA-N
Data  1 KI
  Tab Delimited (TSV)   2D SDfile   Computed 3D by Vconf -m prep SDfile
Find this compound or compounds like it in BindingDB:
Activity Spreadsheet -- Enzyme Inhibition Constant Data from BindingDB
Found 1 hit for monomerid = 301565
TargetMitogen-activated protein kinase kinase kinase 12(Homo sapiens (Human))
Genentech
US Patent
LigandPNGBDBM301565(US10131675, Example 51)
Affinity DataKi:  907nM. Assay description: DLK kinase reactions (20 μL) containing 5 nM N-terminally GST-tagged DLK (catalytic domain amino acid 1-520) (Carna Bioscience), 40 nM N-termina...
Ligand InfoPC cidPC sid
In DepthDetails US Patent