BDBM301712 US9597310, 2::[(S)-6-{(R)-7-Fluoro-4-[4-(3-hydroxy-3-methyl-butoxy)-phenoxy]-indan-1-yloxy}-2,3-dihydro-benzofuran-3-yl]-acetic acid
SMILES CC(C)(O)CCOc1ccc(Oc2ccc(F)c3[C@@H](CCc23)Oc2ccc3[C@H](CC(O)=O)COc3c2)cc1
InChI Key InChIKey=JETNYVZGIZXOEH-WXTAPIANSA-N
Data  1 EC50
  Tab Delimited (TSV)   2D SDfile   Computed 3D by Vconf -m prep SDfile
Find this compound or compounds like it in BindingDB:
Activity Spreadsheet -- Enzyme Inhibition Constant Data from BindingDB
Found 1 hit for monomerid = 301712
TargetFree fatty acid receptor 1(Homo sapiens (Human))
Boehringer Ingelheim International
US Patent
LigandPNGBDBM301712(US9597310, 2 | [(S)-6-{(R)-7-Fluoro-4-[4-(3-hydrox...)
Affinity DataEC50:  5nM. Assay description: IP1 accumulation measurements using the IPOne assay system 1321N1 cells stably expressing human GPR40 receptor (Euroscreen, Belgium) are seeded 24 h ...
Ligand InfoPC cidPC sid
In DepthDetails US Patent