BDBM301756 ((S)-6-{(R)-7-Fluoro-4-[2-fluoro-5-(tetrahydro-2H-pyran-4-yloxy)phenoxy]-indan-1-yloxy}-2,3-dihydrobenzofuran-3-yl)-acetic acid::US9597310, 46
SMILES OC(=O)C[C@@H]1COc2cc(O[C@@H]3CCc4c3c(F)ccc4Oc3cc(OC4CCOCC4)ccc3F)ccc12
InChI Key InChIKey=XZNMIGVKEVYDDK-WGDIFIGCSA-N
Data  1 EC50
  Tab Delimited (TSV)   2D SDfile   Computed 3D by Vconf -m prep SDfile
Find this compound or compounds like it in BindingDB:
Activity Spreadsheet -- Enzyme Inhibition Constant Data from BindingDB
Found 1 hit for monomerid = 301756
TargetFree fatty acid receptor 1(Homo sapiens (Human))
Boehringer Ingelheim International
US Patent
LigandPNGBDBM301756(((S)-6-{(R)-7-Fluoro-4-[2-fluoro-5-(tetrahydro-2H-...)
Affinity DataEC50:  62nM. Assay description: IP1 accumulation measurements using the IPOne assay system 1321N1 cells stably expressing human GPR40 receptor (Euroscreen, Belgium) are seeded 24 h ...
Ligand InfoPC cidPC sid
In DepthDetails US Patent