BDBM301765 ((S)-6-{(R)-7-Fluoro-4-[2-fluoro-4-(1-methyl-1H-pyrazol-5-yl)phenoxy]-indan-1-yloxy}-2,3-dihydrobenzofuran-3-yl)-acetic acid::US9597310, 55
SMILES Cn1nccc1-c1ccc(Oc2ccc(F)c3[C@@H](CCc23)Oc2ccc3[C@H](CC(O)=O)COc3c2)c(F)c1
InChI Key InChIKey=UDXXAOZWAGVLLE-WGDIFIGCSA-N
Data  1 EC50
  Tab Delimited (TSV)   2D SDfile   Computed 3D by Vconf -m prep SDfile
Find this compound or compounds like it in BindingDB:
Activity Spreadsheet -- Enzyme Inhibition Constant Data from BindingDB
Found 1 hit for monomerid = 301765
TargetFree fatty acid receptor 1(Homo sapiens (Human))
Boehringer Ingelheim International
US Patent
LigandPNGBDBM301765(((S)-6-{(R)-7-Fluoro-4-[2-fluoro-4-(1-methyl-1H-py...)
Affinity DataEC50:  6nM. Assay description: IP1 accumulation measurements using the IPOne assay system 1321N1 cells stably expressing human GPR40 receptor (Euroscreen, Belgium) are seeded 24 h ...
Ligand InfoPC cidPC sid
In DepthDetails US Patent