BDBM301923 US9598396, Compound 1
SMILES CC(Cc1ccccc1)(C#N)c1ccc2c3CCCCc3c(=O)[nH]c2c1
InChI Key
Data  2 IC50
  Tab Delimited (TSV)   2D SDfile   Computed 3D by Vconf -m prep SDfile
Find this compound or compounds like it in BindingDB:
Activity Spreadsheet -- Enzyme Inhibition Constant Data from BindingDB
Found 2 hits for monomerid = 301923
TargetPoly [ADP-ribose] polymerase tankyrase-2(Homo sapiens (Human))
Janssen Pharmaceutica
US Patent
LigandPNGBDBM301923(US9598396, Compound 1)
Affinity DataIC50:  14.1nM. Assay description: In principle, the assay relies upon the well established SPA technology for the detection of poly(ADP-ribosyl)ation of biotinylated target proteins, ...
Ligand InfoPC cidPC sid
In DepthDetails US Patent
TargetPoly [ADP-ribose] polymerase 1(Homo sapiens (Human))
Janssen Pharmaceutica
US Patent
LigandPNGBDBM301923(US9598396, Compound 1)
Affinity DataIC50:  36.3nM. Assay description: Compounds of the present invention were tested in an in vitro assay based on SPA technology with Ni Flash plates (96 or 384 well).In principle, the a...
Ligand InfoPC cidPC sid
In DepthDetails US Patent