BDBM301970 3-(4-(4-(4-Cyanopyrimidin-2-yl)piperazin-1-yl)butyl)-1H-indole-5-carbonitrile::US9598401, Example 24
SMILES N#Cc1ccc2[nH]cc(CCCCN3CCN(CC3)c3nccc(n3)C#N)c2c1
InChI Key InChIKey=PVBHTRJNXYBYKN-UHFFFAOYSA-N
Data  1 KI
  Tab Delimited (TSV)   2D SDfile   Computed 3D by Vconf -m prep SDfile
Find this compound or compounds like it in BindingDB:
Activity Spreadsheet -- Enzyme Inhibition Constant Data from BindingDB
Found 1 hit for monomerid = 301970
Target5-hydroxytryptamine receptor 1A(Homo sapiens (Human))
Sunshine Lake Pharma
US Patent
LigandPNGBDBM301970(3-(4-(4-(4-Cyanopyrimidin-2-yl)piperazin-1-yl)buty...)
Affinity DataKi:  6.20nM. Assay description: Human HEK-293 cell homogenates (36 μg protein) were incubated at 22° C. for 60 minutes with 0.3 nM [3H]8-OH-DPAT (Perkin-Elmer) in the absence o...
Ligand InfoPC cidPC sid
In DepthDetails US Patent