BDBM302006 US9598405, 2.5
SMILES CCOC(=O)C1CCC(O)(CC1)c1ncc(s1)-c1cc(C)cc(Nc2cc(ccn2)-c2cn(C)nn2)n1
InChI Key InChIKey=BPMHZEWVKWOGKD-UHFFFAOYSA-N
Data  1 IC50
  Tab Delimited (TSV)   2D SDfile   Computed 3D by Vconf -m prep SDfile
Find this compound or compounds like it in BindingDB:
Activity Spreadsheet -- Enzyme Inhibition Constant Data from BindingDB
Found 1 hit for monomerid = 302006
TargetTyrosine-protein kinase SYK(Homo sapiens (Human))
Merck Sharp & Dohme
US Patent
LigandPNGBDBM302006(US9598405, 2.5)
Affinity DataIC50:  0.316nM. Assay description: A recombinant GST-hSYK fusion protein was used to measure potency of compounds to inhibit human Syk activity. The recombinant human GST-SYK (Carna Bi...
Ligand InfoPC cidPC sid
In DepthDetails US Patent