BDBM302026 US9598405, 3.11
SMILES Cc1cc(Nc2cccc(n2)-c2cnc(s2)[C@@]2(O)CC[C@H](C(O)=O)C(C)(C)C2)ncc1Cl
InChI Key InChIKey=DEMBPFBJZYRMIH-QKFKETGDSA-N
Data  1 IC50
  Tab Delimited (TSV)   2D SDfile   Computed 3D by Vconf -m prep SDfile
Find this compound or compounds like it in BindingDB:
Activity Spreadsheet -- Enzyme Inhibition Constant Data from BindingDB
Found 1 hit for monomerid = 302026
TargetTyrosine-protein kinase SYK(Homo sapiens (Human))
Merck Sharp & Dohme
US Patent
LigandPNGBDBM302026(US9598405, 3.11)
Affinity DataIC50:  0.208nM. Assay description: A recombinant GST-hSYK fusion protein was used to measure potency of compounds to inhibit human Syk activity. The recombinant human GST-SYK (Carna Bi...
Ligand InfoPC cidPC sid
In DepthDetails US Patent