BDBM302028 US9598405, 3.13
SMILES Cc1cc(Nc2cc(C)c(Cl)cn2)nc(c1)-c1cnc(s1)[C@@]1(O)CC[C@H](C(O)=O)C(C)(C)C1
InChI Key InChIKey=QYARSDUAZXOUDZ-OYLFLEFRSA-N
Data  1 IC50
  Tab Delimited (TSV)   2D SDfile   Computed 3D by Vconf -m prep SDfile
Find this compound or compounds like it in BindingDB:
Activity Spreadsheet -- Enzyme Inhibition Constant Data from BindingDB
Found 1 hit for monomerid = 302028
TargetTyrosine-protein kinase SYK(Homo sapiens (Human))
Merck Sharp & Dohme
US Patent
LigandPNGBDBM302028(US9598405, 3.13)
Affinity DataIC50:  0.0970nM. Assay description: A recombinant GST-hSYK fusion protein was used to measure potency of compounds to inhibit human Syk activity. The recombinant human GST-SYK (Carna Bi...
Ligand InfoPC cidPC sid
In DepthDetails US Patent