BDBM30204 Pyrrolopyridine, 35
SMILES O=C(NCc1ccccc1)c1ccc(cc1)-c1cc(ccn1)-c1cc2c(CCNC2=O)[nH]1
InChI Key InChIKey=BUYKQYWJELIXQN-UHFFFAOYSA-N
Data  1 IC50
  Tab Delimited (TSV)   2D SDfile   Computed 3D by Vconf -m prep SDfile
Find this compound or compounds like it in BindingDB:
Activity Spreadsheet -- Enzyme Inhibition Constant Data from BindingDB
Found 1 hit for monomerid = 30204
TargetMAP kinase-activated protein kinase 2(Homo sapiens (Human))
Pfizer
LigandPNGBDBM30204(Pyrrolopyridine, 35)
Affinity DataIC50:  8nM. Assay description: The phosphorylation of HSP27 peptide by MAPKAPK2 was measured using an anion exchange resin capture assay method. The reaction was carried out in rea...
In DepthDetails ArticlePubMed