BDBM302143 3-(4-Fluoro-phenyl)-1-[(R)-1-(4-fluoro-phenyl)-ethyl]-5-methanesulfonyl-4,5,6,7-tetrahydro-1H-pyrazolo[4,3-c]pyridine::US9598410, Compound 9a
SMILES C[C@H](c1ccc(F)cc1)n1nc(c2CN(CCc12)S(C)(=O)=O)-c1ccc(F)cc1
InChI Key InChIKey=ZGVULUIJOKITAC-CQSZACIVSA-N
Data  1 IC50
  Tab Delimited (TSV)   2D SDfile   Computed 3D by Vconf -m prep SDfile
Find this compound or compounds like it in BindingDB:
Activity Spreadsheet -- Enzyme Inhibition Constant Data from BindingDB
Found 1 hit for monomerid = 302143
TargetPotassium channel subfamily K member 3(Homo sapiens (Human))
Sanofi
US Patent
LigandPNGBDBM302143(3-(4-Fluoro-phenyl)-1-[(R)-1-(4-fluoro-phenyl)-eth...)
Affinity DataIC50:  540nM. Assay description: Human TASK-1 channels were expressed in Xenopus oocytes. For this purpose, oocytes were isolated from Xenopus laevis and defoliated. Subsequently, TA...
Ligand InfoPC cidPC sid
In DepthDetails US Patent