BDBM302245 US9598415, 157
SMILES CCS(=O)(=O)c1ccc(CNc2nc3cnc(nc3n([C@@H](C)C3CC3)c2=O)-c2c(OC)ncnc2C2CC2)cn1
InChI Key InChIKey=JAKYSJAPUATEJP-HNNXBMFYSA-N
Data  1 IC50
  Tab Delimited (TSV)   2D SDfile   Computed 3D by Vconf -m prep SDfile
Find this compound or compounds like it in BindingDB:
Activity Spreadsheet -- Enzyme Inhibition Constant Data from BindingDB
Found 1 hit for monomerid = 302245
TargetNuclear receptor ROR-gamma(Homo sapiens (Human))
Boehringer Ingelheim International
US Patent
LigandPNGBDBM302245(US9598415, 157)
Affinity DataIC50:  92nM. Assay description: A nuclear receptor transactivation assay is performed to quantitate the ability of test compounds to inhibit RORγ transactivation of a luciferas...
Ligand InfoPC cidPC sid
In DepthDetails US Patent