BDBM302251 US9598415, 163
SMILES [H][C@@]12CN(C[C@]1([H])C2CNc1nc2cnc(nc2n([C@@H](C)C2CC2)c1=O)-c1c(C)ncnc1C1CC1)S(=O)(=O)CC
InChI Key InChIKey=HMCWHFNJAJAOTH-FAXKSRBJSA-N
Data  1 IC50
  Tab Delimited (TSV)   2D SDfile   Computed 3D by Vconf -m prep SDfile
Find this compound or compounds like it in BindingDB:
Activity Spreadsheet -- Enzyme Inhibition Constant Data from BindingDB
Found 1 hit for monomerid = 302251
TargetNuclear receptor ROR-gamma(Homo sapiens (Human))
Boehringer Ingelheim International
US Patent
LigandPNGBDBM302251(US9598415, 163)
Affinity DataIC50:  160nM. Assay description: A nuclear receptor transactivation assay is performed to quantitate the ability of test compounds to inhibit RORγ transactivation of a luciferas...
Ligand InfoPC cidPC sid
In DepthDetails US Patent