BDBM30229 carboline analog, 41
SMILES CC1CNC(=O)c2[nH]c3ccc(cc3c12)C(=O)Nc1ncccn1
InChI Key InChIKey=KDRXCVVKZIRYMZ-UHFFFAOYSA-N
Data  1 IC50
  Tab Delimited (TSV)   2D SDfile   Computed 3D by Vconf -m prep SDfile
Find this compound or compounds like it in BindingDB:
Activity Spreadsheet -- Enzyme Inhibition Constant Data from BindingDB
Found 1 hit for monomerid = 30229
TargetMAP kinase-activated protein kinase 2 [41-364](Homo sapiens (Human))
Boehringer Ingelheim Pharmaceuticals
LigandPNGBDBM30229(carboline analog, 41)
Affinity DataIC50: >2.00E+4nMpH: 7.6 T: 2°C. Assay description: Diluted compounds and activated GST-MK2 were incubated in neutravidin coated plates (Pierce) in reaction buffer containing biotinylated GST-LSP1 and ...
In DepthDetails ArticlePubMed