BDBM302390 4-Amino-5-(7-methoxy-5-methyl-1-benzothiophen-2-yl)-N,N-dimethylpyrrolo[2,1-f][1,2,4]triazine-6-carboxamide::US9598416, Example 36
SMILES COc1cc(C)cc2cc(sc12)-c1c(cn2ncnc(N)c12)C(=O)N(C)C
InChI Key InChIKey=VKJJMSQMKBRCIC-UHFFFAOYSA-N
Data  1 IC50
  Tab Delimited (TSV)   2D SDfile   Computed 3D by Vconf -m prep SDfile
Find this compound or compounds like it in BindingDB:
Activity Spreadsheet -- Enzyme Inhibition Constant Data from BindingDB
Found 1 hit for monomerid = 302390
TargetFibroblast growth factor receptor 1(Homo sapiens (Human))
Bayer Intellectual Property
US Patent
LigandPNGBDBM302390(4-Amino-5-(7-methoxy-5-methyl-1-benzothiophen-2-yl...)
Affinity DataIC50:  37.5nM. Assay description: Usually, test compounds were tested on the same microtiter plate at 11 different concentrations in the range of 20 μM to 0.1 nM (e.g. 20 μM...
Ligand InfoPC cidPC sid
In DepthDetails US Patent