BDBM30243 carboline analog, 55
SMILES CCOC(=O)c1cccc(NC(=O)c2ccc3[nH]c4c(C(C)CNC4=O)c3c2)c1
InChI Key InChIKey=LHXHLXVGEPJZDV-UHFFFAOYSA-N
Data  1 IC50
  Tab Delimited (TSV)   2D SDfile   Computed 3D by Vconf -m prep SDfile
Find this compound or compounds like it in BindingDB:
Activity Spreadsheet -- Enzyme Inhibition Constant Data from BindingDB
Found 1 hit for monomerid = 30243
TargetMAP kinase-activated protein kinase 2 [41-364](Homo sapiens (Human))
Boehringer Ingelheim Pharmaceuticals
LigandPNGBDBM30243(carboline analog, 55)
Affinity DataIC50:  7.40E+3nM. Assay description: Diluted compounds and activated GST-MK2 were incubated in neutravidin coated plates (Pierce) in reaction buffer containing biotinylated GST-LSP1 and ...
In DepthDetails ArticlePubMed