BDBM30248 carboline analog, 60
SMILES CC1CNC(=O)c2[nH]c3ccc(cc3c12)C(=O)Nc1ccc(cc1)C(C)(C)C
InChI Key InChIKey=USRHDCXZMWWLEP-UHFFFAOYSA-N
Data  1 IC50
  Tab Delimited (TSV)   2D SDfile   Computed 3D by Vconf -m prep SDfile
Find this compound or compounds like it in BindingDB:
Activity Spreadsheet -- Enzyme Inhibition Constant Data from BindingDB
Found 1 hit for monomerid = 30248
TargetMAP kinase-activated protein kinase 2 [41-364](Homo sapiens (Human))
Boehringer Ingelheim Pharmaceuticals
LigandPNGBDBM30248(carboline analog, 60)
Affinity DataIC50: >2.00E+4nM. Assay description: Diluted compounds and activated GST-MK2 were incubated in neutravidin coated plates (Pierce) in reaction buffer containing biotinylated GST-LSP1 and ...
In DepthDetails ArticlePubMed