BDBM302508 N5-(2,2-Difluorobenzo [d][1,3]dioxol-5-yl)-2- (3-fluorophenyl)-6,7- dihydropyrazolo[1,5-a] pyrazine-3,5(4H)- dicarboxamide::US9598423, Example 74
SMILES NC(=O)c1c2CN(CCn2nc1-c1cccc(F)c1)C(=O)Nc1ccc2OC(F)(F)Oc2c1
InChI Key InChIKey=SWGPCPDWWKGAJL-UHFFFAOYSA-N
Data  2 IC50
  Tab Delimited (TSV)   2D SDfile   Computed 3D by Vconf -m prep SDfile
Find this compound or compounds like it in BindingDB:
Activity Spreadsheet -- Enzyme Inhibition Constant Data from BindingDB
Found 2 hits for monomerid = 302508
TargetCasein kinase I isoform delta(Homo sapiens (Human))
Bristol-Myers Squibb
US Patent
LigandPNGBDBM302508(N5-(2,2-Difluorobenzo [d][1,3]dioxol-5-yl)-2- (3-f...)
Affinity DataIC50: <10nM. Assay description: The kinase assay was performed in V-bottom 384-well plates. The final assay volume was 30 μl prepared from 15 μl additions of enzyme, subst...
Ligand InfoPC cidPC sid
In DepthDetails US Patent
TargetCasein kinase I isoform epsilon(Homo sapiens (Human))
Bristol-Myers Squibb
US Patent
LigandPNGBDBM302508(N5-(2,2-Difluorobenzo [d][1,3]dioxol-5-yl)-2- (3-f...)
Affinity DataIC50: <10nM. Assay description: The kinase assay was performed in V-bottom 384-well plates. The final assay volume was 30 μl prepared from 15 μl additions of enzyme, subst...
Ligand InfoPC cidPC sid
In DepthDetails US Patent